C2601 Error

Huawei C2601 Unlock Code - Free Instructions

RECOMMENDED: If you have Windows errors then we strongly recommend that you download and run this (Windows) Repair Tool.

Code tries to define a function within a function. There may be an extra brace in your source code before the. j++; } }

Compiler Error C2601 – MSDN – Microsoft – The new home for Visual Studio documentation is Visual Studio 2017 Documentation on docs.microsoft.com. The latest version of this topic can be found at Compiler Error C2601. function' : local function definitions are illegal. Code tries to define a function within a function. Or, there may be an extra brace in your source.

Error Inserting Battery Dec 07, 2007  · The problem is actually quite common throughout all camera brands. Usually it’s sand or grit interfering with the lens extension mechanism. Or the camera’s. You cannot format the memory or erase all the files in a folder because of insufficient battery power. Replace the. DATA ERR. You cannot play back or edit

I'm writing a small program in C++. When I try to compile it using MS VS 2013 Compiler I get an error: "C2601: 'main' : local function definitions are illegall". What.

Nov 13, 2014. So I'm messing around with calling functions in C++ since I am still very new to this language and I've been stuck on this error for like 20 minutes and I can't find an answer anywhere. It keeps on giving me the error : error C2601: 'TimesTwo : local function definitions are illegal and the same for my Test.

Please help, My error is "Error C2601: ‘BlackOps2’ : Local Function Definitions Are Illegal." I edited the post and added the full code. Please help. By the way, if.

Apr 13, 2017. I couldn't see a function within a function or an extra brace! error C1075: end of file found before the left brace '{' at 'c:users. was matched c:users.. error C2601: 'Library::Search' : local function definitions are illegal error C2601: ' Library::DeleteBook' : local function definitions are illegal. There are 3.

Compiler Error C2601. 11/04/2016 2 minutes to read Contributors. Or, there may be an extra brace in your source code before the location of the C2601 error.

Apr 23, 2013  · Local Function Definition error. Comp rook. I’ve scoured the. (44) : error C2601: ‘function’ : local function definitions are illegal Can anyone figure it out?

Api Error 1036 Error Codes. Here is a list of error codes and descriptions returned by our APIs: 1000 Missing or duplicate access token; 1001 Invalid access token; 1002 Invalid. 1035 Missing oauth_token parameter; 1036 oauth_token invalid or expired; 1037 The required scope to access this endpoint was not granted by the user; 1038. I developed a Windows
Ubuntu Php Configure Error Cannot Find Libmysqlclient Under /usr May 21, 2010. I tried to follow this tutorial but when php configuring I got this error: configure: error: Cannot find libmysqlclient under /usr/local. I tried to create a symlink from / usr/lib64 to /usr/local for libmysqlclient.so and using –with-libdir=lib64, but it didnt help. Also…I'm changing the –with-mysql=… path but the. mysql5のconfigureで以下のようなメッセージが出るとき、 configure: error: Cannot

How to get rid of error C2601?. Learn more about mex

E'); } }; This is my code, and it gives me the following errors: 1> c:.22_proj2.cpp( 33) : error C2601: 'avg' : local function definitions are illegal 1> c:.22_proj2.cpp( 8): this line contains a '{' which has not yet been matched 1> c:.22_proj2.cpp( 75) : error C2601: 'menu' : local function definitions are illegal

Below is some of my C++ code. I’m getting this error: C2601: ‘main’ : local function definitions are illegal Why do I get this? BOOL CBasicApp::InitInstance.

Jan 14, 2008  · C++ error: Local function definitions are illegal?. My C++ prog is showing error:error C2601:. Local function definitions are illegal? help me fix this?

local function definitions are illegal? – UE4 AnswerHub – When trying to build i get this error: C:UsersJoeDocumentsUnreal Projects FPSProjectSourceFPSProjectFPSGameMode.cpp(11): error C2601: ' AFPSGameMode::StartPlay' : local function definitions are illegal. I am reading from This Tutorial and have not differed from it at all, however i cannot complete.

error C2601: 'myfunc' : local function definitions are illegal – Services usually don't have GUI and do not display dialogs. Redesign.– pa

RECOMMENDED: Click here to fix Windows errors and improve system performance