Error Failing Attr 05

RECOMMENDED: If you have Windows errors then we strongly recommend that you download and run this (Windows) Repair Tool.

Advanced Bash-Scripting Guide – TLDP – Advanced Bash-Scripting Guide An in-depth exploration of the art of shell scripting Mendel Cooper <

Photo-Sphere-Viewer – A JavaScript library to display Photo Sphere panoramas.

For example, the "Reallocated Sectors Count" attribute value decreases as the number of. Potential indicators of imminent electromechanical failure. 05. Reallocated Sectors Count. disk monitor smart attributes. Count of reallocated sectors. When the hard drive finds a read/write/verification error, it marks this sector as.

Sony Storstation Error Codes Error Reading Input The Cadence OrCAD product line provides affordable, high-performance PCB design tools that boost productivity for smaller design teams and individual PCB designers. cp fails to copy with errors "cp: error reading 'file': Input. – cp fails to copy with errors "cp: error reading 'file': Input/output error" and "cp: failed to extend 'file':

This document discusses the different states that Cable Modems (CMs) go through before coming online and establishing IP connectivity. The document highlights the.

Doctors attribute the failure of tubectomy to three main reasons. medical experts said. Thirdly, it could also be error on the par of surgeons. Get latest news & live updates on the go on your pc with News App. Download The Times of.

Network Controller – May require cleaning up the PA and DR Host vNICs on the server on which this error was reported DhcpAddressAllocationFailure DHCP address allocation failed for a VMNic Check if the static IP address attribute.

Error 1720 Smart HD – Ingeniería Informática – Todoexpertos.com – Un error S.M.A.R.T corresponde a errores físicos, no logicos, por lo que cualquier intento de CHKDSK o similar no lo reparará. Haz un backup.

Ora-00942 Error Erwin Error Reading Input The Cadence OrCAD product line provides affordable, high-performance PCB design tools that boost productivity for smaller design teams and individual PCB designers. cp fails to copy with errors "cp: error reading 'file': Input. – cp fails to copy with errors "cp: error reading 'file': Input/output error" and "cp: failed to extend 'file':

Error 8418: The replication operation failed because of a schema mismatch. For issues where schema replication fails due to improper attribute schema. 24260 f4617e99-9688-42a6-8562-43fdd2d5cda4 18085395 2002-05-24 12:00:02 2

UPDATED How To Fix: External Disk Drive Suddenly Became RAW. DISCLAIMER: These examples use techniques that I actually employ in the real world to deal with real.

How monitor and control jobs on. so that you can check possible problems during that time for failing. 05:57:31 Thu Sep 1 15:02:50 4 active jobs.

Error Code 3001 Blackberry Playbook Playbook users, who over the last couple days were enjoying all the free streaming TV shows that Hulu’s website provides, have now discovered a big fat error message. “We notice that you are trying to access Hulu from your. Solution for blackberry playbook error 3001? Blackberry playbook is unable to connect with cisco linksys wrt56gusing

May 3, 2016. Rails 5 makes it possible to return information about failed validator. for :name attribute, the client app would be able to customize the error.

1: Maximum likelihood parameter estimates for logarithm of γ parameter, testing for subjective preference for one attribute over another. Supplementary Fig. 3: Alternative choice models fail to capture. reward prediction error-encoding.

I get this weird error message 15/01/26 13:05:12 INFO spark.SparkContext: Created broadcast 0 from wholeTextFiles at NativeMethodAccessorImpl.java:-2 Traceback (most.

RECOMMENDED: Click here to fix Windows errors and improve system performance