Error Uikit/uikit.h No Such File Or Directory

Stanford - Developing iOS 8 Apps with Swift - 1. Logistics, iOS 8 Overview

RECOMMENDED: If you have Windows errors then we strongly recommend that you download and run this (Windows) Repair Tool.

ios – UIKit/UIKit.h file not found – Stack Overflow – Oct 9, 2014. Add pch file in you in xcode project to resolve this very easily. Make new file: ⌘ cmd+N. iOS/Mac > Other > PCH File > YourProject-Prefix.pch.

calabash-ios setup clang: error: no such file or directory 'UIKit' Ask Question. up vote 4 down vote favorite.

I didn't change anything in my project, and now when I compile it is says UIKit/UIKit.h:No such file or directory, and the same thing for…

May 18, 2012. It sounds like you removed the UIKit.framework from your project at some point. Check if it is listed in your project navigator. If it's not there, go to.

Still trying to resolve UIKit/UIKit.h no such file or directory. Anyone tell me how I can resolve this error by stepping. the UIKit framework was not installed.

clang -o window window.m window.m:1:9: fatal error: 'UIKit/UIKit.h' file not found #import. Any such framework, if it has a Headers directory, will be resolved as.

Solo Un Error Moving On Letra Lyrics of SOLO UN ERROR by Moving On: Ya no entiendo0o!, como es ke todo se partio tan lento entre los tu y yo!!, Solo un error!!, se necesita para romper. El mas triste adios de Moving On, letra de la canción con el video. Encuentre más letras y videos de Moving On en Album

Jan 22, 2015. You can safely ignore the “exec ldid: No such file or directory” error message. I will remove the. #cgo LDFLAGS: -framework UIKit -framework Foundation – framework CoreGraphics extern void. #import <UIKit/UIKit.h>

Jscript Error Object Truffle — Microsoft JScript runtime error – Ethereum Stack Exchange – Jul 11, 2017. Otherwise you can simply rename the file. C:UsernameAppDataRoamingnpm truffle.bat. (for exmaple in truf.bat ); in this way, as you said, name: The name of the error, or more specifically, the name of the constructor function the error belongs to. message: A

fatal error: Python.h: No such file or directory error: command 'x86_64-linux-gnu-gcc' failed with exit status 1. Hot Network Questions

highlight.js demo – 1C:Enterprise (v7, v8) #ЗагрузитьИзФайла ext_module.txt // директива 7.7 #Если Клиент ИЛИ НаКлиенте Тогда.

Wireshark – Defined 563 NCP types. Making dissectors.c./make-dissectors @dissectors.c.in > dissectors.c rm: cannot remove ‘dissectors.c.in’: No such file or directory make[4]: *** [dissectors.c] Error 1 make[4]: Leaving directory.

This caused my site to start showing the following error: Warning: require_once(/home/mischavie/mischavie.com/wp-content/plugins/jetpack/_inc/lib/class.media.php): failed to open stream: No such file or directory in.

On the Ubuntu computer, Files/Network clicking on Windows Network received "Unable to access location – Failed to retrieve share list from server: No such file or directory" error. Both Windows computers were able to use the Ubuntu.

Nov 29, 2014. As Prefix header parsed only once it make compilation fast. version of Xcode is not creating <ProjectName>-Prefix.pch file for your project. #endif #ifdef __ OBJC__ #import <UIKit/UIKit.h> #import <Foundation/Foundation.h> #endif. 4. i am getting linker error while placing any parameter in the.pch file

Time Machine uses the magic of hard links, a feature that HFS+ file systems.

If the.h file is not in the same directory as your sln file then you need to add the directory to the include file search list. See Tools, Options.

The approved answer is great, but if you’re looking for a 1 minute answer try this: MyClass.h file should look like this (add delegate lines with comments!)

RECOMMENDED: Click here to fix Windows errors and improve system performance