Fatal Error Stdafx.h No Such File Or Directory

RECOMMENDED: If you have Windows errors then we strongly recommend that you download and run this (Windows) Repair Tool.

You can enable logging with the UnifiedServiceDesk.exe.config file. event logs and error reporting text files. ExitReport.txt Exit log created in the event of a fatal or non-fatal exception. Contains process state information such.

Copy the stdafx.h file from your Visual Studio project folder into the Code::Blocks project folder and carry on with the build. or. If you don't have.

Apr 23, 2013. facePart.cpp(5) : fatal error C1083: Cannot open include file: 'stdafx.h': No such file or directory. Anyone can help me figure out the problem.

Win98 Msgsrv32 Error Hi, My sister-in-law has been having a problem booting up her Win98 system ever since her brother was on-line and "did something ". He's not sure. If it is off Microsoft’s well-worn path, bushwhack your own trail with Windows 98 Annoyances. Here’s more than 400 pages. and actually wind up with a working computer. Fix
Run Time Error 430 Automation Boost Your PC Speed & Performance – Defrag, Clean & Optimize Your PC Today! Nov 5, 2012. Run-time error '430': Class does not support Automation or does not support expected interface. Error message when you try to process a. Win98 Msgsrv32 Error Hi, My sister-in-law has been having a problem booting up her Win98 system

Pushing/pulling from within RStudio, however, threw an error: ssh_askpass: exec(/usr/X11R6/bin/ssh-askpass): No such file or directory Permission denied (publickey). fatal: Could not read from remote repository. Please make sure you.

Oct 12, 2014. Ensure you have the file "stdafx.h" in your project. It is supposed to be a project local file, not to be resolved in include directories. Just include windows.h instead of stdfax or create a clean project without template. Visual Studio 2013 fatal error c1083:cannot open include file “stadfx.h” no such file or.

. No such file or directory” while compiling a C file. fatal error: stdio.h : No such file or directory. fatal error: stdio.h : No such file or directory.

I am new to visual studio.I have created a simple console application and then selected an empty project of c++. I have pasted the code form http://www.cprogramming.

Using such heavy libraries as a boost. “How to use precompiled headers”. Fatal error C1010: unexpected end of file while looking for precompiled header. Did you forget to add ‘#include “stdafx.h”‘ to your source? The error text says it.

Cannot open include file: 'StdAfx.h': No such file or directory. include-file-stdafxh-no-such-file-or-directory. fatal error C1083: Cannot open include file:.

An Error Encountered While Opening A Window Notes Hi, and thanks for stopping by! I and a few of my users are experiencing a problem where Lotus appears to crash if closed abruptly. When you try and re-open Lot Foxit Reader – Version History | Foxit Software – Need a quick and easy way to read PDF files without using Adobe Acrobat? Foxit

Am 01.09.2017 um 22:32 schrieb Stephen Boyd: > On 08/25, Andreas Färber wrote: >> It fails to build once we introduce the ARCH_MB86S7X Kconfig symbol: >> drivers/clk/clk-mb86s7x.c:27:10: fatal error: soc/mb86s7x/scb_mhu.h: No.

. Cannot open include file: 'stdafx.h': No such file or directory. error: fatal error C1083: Cannot open include. C1083 Cannot open include file: 'stdafx.h':.

test.cc:1:20: error: stdafx.h: No such file or directory. How should I. As far as I know, stdafx.h is a Microsoft Windows-specific header file. It does.

c++ – Fatal error: 'stdafx.h' file not found – Stack Overflow – stdafx.h is the precompiled header used by visual studio, you do not need this. b) 'end1' should be 'endl' (note the letter 'l' vs. the number '1').

. \mkrich\mkrich\stdafx.h(21) : fatal error C1083: Cannot open include file: 'afxwin.h': No such file or. you'll get that "no such file or directory.

Warning: include(/home/devraul/lakewoodalive.com/wp-content/plugins/wordpress-seo/admin/onpage/class-onpage.php): failed to open stream: No such file or directory in /home. ClassLoader52.php on line 186 Fatal error: Class.

However, during compilation, I am encountering the error: "fatal error: x264.h: No such file or directory" How can I fix this error? The following compilation error indicates that you do not have x264 library’s development files installed on.

Join GitHub today. GitHub is home to. (314): fatal error C1083: Cannot open include file: ‘sqlfront.h’: No such file or directory error: command ‘C:Program Files.

Tag: fatal error C1083: Cannot open include file:. No such file or directory. No such file or directory, fatal error LNK1120,

RECOMMENDED: Click here to fix Windows errors and improve system performance