Gave Error Exit Status 255

Codeblocks error Permission denied

RECOMMENDED: If you have Windows errors then we strongly recommend that you download and run this (Windows) Repair Tool.

Error Obtaining Parser From Data Source May 25, 2017. Multiple datasource not working as documented for grails 3.3.0. Expression parsing failed; nested exception is org.springframework.expression.spel. appeared to change error and appears to have moved on from that error. not obtain current Hibernate Session; nested exception is org.hibernate. This document is an introduction to the Lemon parser generator. The main goal of

0 (zero; / ˈ z ɪər oʊ /) is both a number and the numerical digit used to represent that number in numerals. The number 0 fulfills a central role in mathematics.

bug: return doesn't accept negative numbers. I guess I don't use negative return codes that often in shell, but I use them as exit codes reasonably often. 'return.

For Final Fantasy VIII on the PlayStation, FAQ/Walkthrough by Absolute Steve.

"INFO gave up: dogstatsd entered FATAL state, too many start retries too quickly" #1159

England’s step into the unknown became a tale of the very predictable yesterday when Joe Root and Alastair Cook,

Lmgrd slbsls exited with status 255. Lmgrd slbsls exited with status 255 keyword after analyzing the system lists the list of keywords related and the list of.

First the pundits in the studio, the exit polls and computer graphics. Some MPs are accorded a higher status: so when Eric Pickles joined the Cabinet, he also became a member of the Privy Council (don’t ask) and so he is entitled to be.

[SOLVED] "subprocess pre-removal script returned error exit. – Recently, I encountered a package management related error in Ubuntu Jaunty Jackalope 64bit. The package was python-beagle and the error was: "E: python

Good job. It seems like the problem that reported by Onyx and Disk Utility was pretty minor, and doing the restore (clone the clone back) fixed whatever was wrong.

LONDON (AP) — Five of Britain’s biggest business groups are calling on the government to quickly agree to a transition period of at least two years following the country’s exit from the European. close as possible to the status quo".

Optional parameter is indicated with the notation {Optional}. Application or Component may decide not to use that parameter in the alarm message.

It might give your sister a nasty shock when she sneaks into your room. whatever you want your alarm to be — just change the RGB values). void loop(){ color(255,0,0); //red delay(100); color(255,255,0); //yellow delay(100); } Upload and.

NTFS-3G is a stable, full-featured, read-write NTFS driver for Linux, Android, Mac OS X, FreeBSD, NetBSD, OpenSolaris, QNX, Haiku, and other operating systems.

Oct 18, 2017. –error-log-path=/var/log/nginx/error.log. error: dpkg-source -b nginx-1.12.2 gave error exit status 255 debuild: fatal error at line 1376:.

Vb6 File Not Found Error 53 Error 53 File not found. I can’t reproduce the file not found error. Error creating “ Access.Application” Object on Visual Basic with Office 2007. 0. "The CRA’s reported rate does not. found that the agency gave wrong answers. As web developers with a ‘traditional’ VB or C# asp /.NET background, we are quite blessed with

How to connect android application to MS SQL server database.

The Cam Newton kerfuffle, wherein the 2015 NFL MVP suggested that he wasn’t receiving sufficient protection from illegal hits, was resolved in part by the NFL arguing, essentially, that it fails to protect other quarterbacks more. And so the.

boot2docker hangs, then crashes – Boot2Docker – Docker Forums – It gave me this message: Waiting for VM and Docker daemon to start. error in run: Error requesting socket: exit status 255. You can now use.

Kwin Error Error Cd Dvd Route 66 Sync Route 66 sync update I have a. Uninstalled Route 66, re-installed old version from CD, Raised a bug report with Route66 support who say there is no error with. There are cool ways to risk your life. For example, being a firefighter, rescuing a wolf from a bear trap,

Nov 9, 2014. dpkg-parsechangelog: error: changelog parser /usr/lib/dpkg/parsechangelog/ debian gave error exit status 255 parsechangelog/debian:.

The judges gave the state legislature 180 days to respond. Some even forbid social workers to "discriminate" based on marital status. The key way that marriage protects parental rights is the legal presumption of paternity: The husband is.

Mar 24, 2006. Windows System Error Codes (exit codes). The table below describes these Error codes. Causes. 255 The extended attributes are inconsistent. 1273 An application-defined callback gave invalid data when called.

running install_lib creating /Library/Python/2.7/site-packages/uniconvertor error:. failed with exit status. command 'gcc-4.2' failed with exit status 255. 17.

Building Packages – Tanglu Wiki – Apr 13, 2008. Error: Unable to find development files for libass. target 'build' failed dpkg- buildpackage: error: debian/rules build gave error exit status 2. error: dpkg- source -b lammps-0~20120615.gite442279 gave error exit status 255.

RECOMMENDED: Click here to fix Windows errors and improve system performance