Macports Lion Configure Error C Compiler Cannot Create Executables

RECOMMENDED: If you have Windows errors then we strongly recommend that you download and run this (Windows) Repair Tool.

Nov 3, 2009. configure: error: C compiler cannot create executables. For the record, what version of OS X and Mac hardware are you running?. cannot create executables" error, despite not having problems with MacPorts or compiling.

If I don’t answer immediately, check tomorrow and i’m sure it will be. Update: This is already getting great feedback, so welcome to the new series "Tech Support for Kossacks" which will be featured every Monday night around 8pm.

Sep 1, 2013. configure: error: C compiler cannot create executables #440. Closed. Unable to install ruby 2.1.2 on mac os x maverick #622 · @jmervine.

C compiler cannot create executables under Lion. got the "C compiler cannot create executables" error. expat Error: Target org.macports.configure.

expat: configure: error: C compiler cannot create. – MacPorts –. configure: error: C compiler cannot create executables :. checking for C compiler version configure. for PowerPC on Lion. Modify your macports.conf as I.

You do not necessarily have to build R in the top-level source directory (say, TOP_SRCDIR). To build in BUILDDIR, run cd BUILDDIR TOP_SRCDIR/configure make and so on, as described further below. This has the advantage of always.

. Configuring gperf Error: Target org.macports.configure. OS Lion – universal binary won't compile to. C compiler cannot create executables to.

/Developer/usr/bin/llvm-gcc-4.2 :info:configure checking for C compiler default output file name. configure: error: C compiler cannot create executables.

Admin User Restricted Access Error Sep 27, 2013. CouchDB has the idea of an admin user (e.g. an administrator, a super. curl -X PUT $HOST/somedatabase {"error":"unauthorized","reason":"You are not a server admin."}. Users may only access ( GET /_users/org.couchdb.user:Jan ) or. actions of a database admin are restricted to a specific database. Search for jobs related to Joomla restricted access error
Error Code 1000008e Parameter1 C0000005 Parameter2 8054afd2 Esea Error 100 I believe that Euroseas (ESEA) offers both large upside (80%. If he sold at the average volume of 93.7k, and assuming 100% of the market was made by the seller, it would take 119 days to close the full position at average volume. It. Gmail is email that’s intuitive, efficient, and useful.

Oct 24, 2013. As is often the case after a Mac OS X upgrade, installing Ruby gems that depend. configure: error: C compiler cannot create executables See.

Download as many copies for as many computers as needed. Control Allied has the relay you need to keep it. N a t i o n a l C o n t r o l s C o r p. Take control at thinkallied.com/relays 1.800.433.5700 © Allied Electronics, Inc 2015. ‘Allied.

Home > Configure Error > Configure Error C Compiler Cannot Create Executables Lion Configure Error C. Error C Compiler Cannot Create Executables See. Macports.

DeSmuME FAQ 0.9.11. This FAQ holds a list of many commonly asked questions about DeSmuME. If you need information about an older version, refer to one of the older.

Make sure you install MacPorts properly prior to running the ‘sudo port -v selfupdate’. It’s saying ‘command not found’, because ‘port’ (ie. macports.

Apr 27, 2012. This was one Mac OSX Mavericks. "configure: error: C compiler cannot create executables". In the end nothing worked, because my problem.

FAQ – MacPorts – I get the error "C compiler cannot create executables" or "ld: library not found for. I have a local repository set up; What is the process for becoming a committer?. This means that if you migrate from, say, a PowerPC Mac to an Intel one and.

Esea Error 100 I believe that Euroseas (ESEA) offers both large upside (80%. If he sold at the average volume of 93.7k, and assuming 100% of the market was made by the seller, it would take 119 days to close the full position at average volume. It. Gmail is email that’s intuitive, efficient, and useful. 15 GB of

configure result "checking whether the C compiler. no configure: error: in `/opt/local/var/macports. error: C compiler cannot create executables >> See.

. Configuring expat Error: Target org.macports.configure. configure checking for C compiler. error: C compiler cannot create executables :.

Dream – If anything seems slightly amiss, I tell myself to hover or fly. When you conduct your test is important, though. Create a rule set for yourself and follow it. For example, you can establish that you’ll execute your test every time you: go to.

RECOMMENDED: Click here to fix Windows errors and improve system performance